Guernsey
type: Class
subclass of: Country
subclass of: Northern Europe
comment: Country/country-like geography class. Document-parsed mentions of this geography can be instantiated as members of this class.
ISO 3166-1 alpha-2 code: GG
ISO 3166-1 alpha-3 code: GGY
source subregion name: Northern Europe
source region name: Europe
part of class: Northern Europe

Sweden
type: Class
subclass of: Country
subclass of: Northern Europe
comment: Country/country-like geography class. Document-parsed mentions of this geography can be instantiated as members of this class.
ISO 3166-1 alpha-2 code: SE
ISO 3166-1 alpha-3 code: SWE
source subregion name: Northern Europe
source region name: Europe
part of class: Northern Europe

Lebanon
type: Class
subclass of: Country
subclass of: Middle East
comment: Country/country-like geography class. Document-parsed mentions of this geography can be instantiated as members of this class.
ISO 3166-1 alpha-2 code: LB
ISO 3166-1 alpha-3 code: LBN
source subregion name: Western Asia
source region name: Asia
part of class: Middle East

Saint Vincent and the Grenadines
type: Class
subclass of: Country
subclass of: Caribbean
comment: Country/country-like geography class. Document-parsed mentions of this geography can be instantiated as members of this class.
ISO 3166-1 alpha-2 code: VC
ISO 3166-1 alpha-3 code: VCT
source subregion name: Caribbean
source region name: Americas
part of class: Caribbean

Tuvalu
type: Class
subclass of: Country
subclass of: Polynesia
comment: Country/country-like geography class. Document-parsed mentions of this geography can be instantiated as members of this class.
ISO 3166-1 alpha-2 code: TV
ISO 3166-1 alpha-3 code: TUV
source subregion name: Polynesia
source region name: Oceania
part of class: Polynesia

Kazakhstan
type: Class
subclass of: Country
subclass of: Central Asia
comment: Country/country-like geography class. Document-parsed mentions of this geography can be instantiated as members of this class.
ISO 3166-1 alpha-2 code: KZ
ISO 3166-1 alpha-3 code: KAZ
source subregion name: Central Asia
source region name: Asia
part of class: Central Asia

Brazil
type: Class
subclass of: Country
subclass of: South America
comment: Country/country-like geography class. Document-parsed mentions of this geography can be instantiated as members of this class.
ISO 3166-1 alpha-2 code: BR
ISO 3166-1 alpha-3 code: BRA
source subregion name: South America
source region name: Americas
part of class: South America

Region
type: Class
comment: A sub-continental or cross-national geographic grouping such as South Asia or the Middle East.
subclass of: Geographic Entity

Christmas Island
type: Class
subclass of: Country
subclass of: Australia And New Zealand
comment: Country/country-like geography class. Document-parsed mentions of this geography can be instantiated as members of this class.
ISO 3166-1 alpha-2 code: CX
ISO 3166-1 alpha-3 code: CXR
source subregion name: Australia and New Zealand
source region name: Oceania
part of class: Australia And New Zealand

Guinea-Bissau
type: Class
subclass of: Country
subclass of: West Africa
comment: Country/country-like geography class. Document-parsed mentions of this geography can be instantiated as members of this class.
ISO 3166-1 alpha-2 code: GW
ISO 3166-1 alpha-3 code: GNB
source subregion name: Western Africa
source region name: Africa
part of class: West Africa

Madagascar
type: Class
subclass of: Country
subclass of: East Africa
comment: Country/country-like geography class. Document-parsed mentions of this geography can be instantiated as members of this class.
ISO 3166-1 alpha-2 code: MG
ISO 3166-1 alpha-3 code: MDG
source subregion name: Eastern Africa
source region name: Africa
part of class: East Africa

Ivory Coast
type: Class
subclass of: Country
subclass of: West Africa
comment: Country/country-like geography class. Document-parsed mentions of this geography can be instantiated as members of this class.
ISO 3166-1 alpha-2 code: CI
ISO 3166-1 alpha-3 code: CIV
source subregion name: Western Africa
source region name: Africa
part of class: West Africa

Nepal
type: Class
subclass of: Country
subclass of: South Asia
comment: Country/country-like geography class. Document-parsed mentions of this geography can be instantiated as members of this class.
ISO 3166-1 alpha-2 code: NP
ISO 3166-1 alpha-3 code: NPL
source subregion name: Southern Asia
source region name: Asia
part of class: South Asia

Vanuatu
type: Class
subclass of: Country
subclass of: Melanesia
comment: Country/country-like geography class. Document-parsed mentions of this geography can be instantiated as members of this class.
ISO 3166-1 alpha-2 code: VU
ISO 3166-1 alpha-3 code: VUT
source subregion name: Melanesia
source region name: Oceania
part of class: Melanesia

New Zealand
type: Class
subclass of: Country
subclass of: Australia And New Zealand
comment: Country/country-like geography class. Document-parsed mentions of this geography can be instantiated as members of this class.
ISO 3166-1 alpha-2 code: NZ
ISO 3166-1 alpha-3 code: NZL
source subregion name: Australia and New Zealand
source region name: Oceania
part of class: Australia And New Zealand

Sudan
type: Class
subclass of: Country
subclass of: North Africa
comment: Country/country-like geography class. Document-parsed mentions of this geography can be instantiated as members of this class.
ISO 3166-1 alpha-2 code: SD
ISO 3166-1 alpha-3 code: SDN
source subregion name: Northern Africa
source region name: Africa
part of class: North Africa

The Gambia
type: Class
subclass of: Country
subclass of: West Africa
comment: Country/country-like geography class. Document-parsed mentions of this geography can be instantiated as members of this class.
ISO 3166-1 alpha-2 code: GM
ISO 3166-1 alpha-3 code: GMB
source subregion name: Western Africa
source region name: Africa
part of class: West Africa

Mayotte
type: Class
subclass of: Country
subclass of: East Africa
comment: Country/country-like geography class. Document-parsed mentions of this geography can be instantiated as members of this class.
ISO 3166-1 alpha-2 code: YT
ISO 3166-1 alpha-3 code: MYT
source subregion name: Eastern Africa
source region name: Africa
part of class: East Africa

Philippines
type: Class
subclass of: Country
subclass of: Southeast Asia
comment: Country/country-like geography class. Document-parsed mentions of this geography can be instantiated as members of this class.
ISO 3166-1 alpha-2 code: PH
ISO 3166-1 alpha-3 code: PHL
source subregion name: South-Eastern Asia
source region name: Asia
part of class: Southeast Asia

Tajikistan
type: Class
subclass of: Country
subclass of: Central Asia
comment: Country/country-like geography class. Document-parsed mentions of this geography can be instantiated as members of this class.
ISO 3166-1 alpha-2 code: TJ
ISO 3166-1 alpha-3 code: TJK
source subregion name: Central Asia
source region name: Asia
part of class: Central Asia

Egypt
type: Class
subclass of: Country
subclass of: North Africa
subclass of: Middle East
comment: Country/country-like geography class. Document-parsed mentions of this geography can be instantiated as members of this class.
comment: Modeled under both NorthAfrica and MiddleEast because Egypt is commonly included in Middle East geopolitical usage.
ISO 3166-1 alpha-2 code: EG
ISO 3166-1 alpha-3 code: EGY
source subregion name: Northern Africa
source region name: Africa
part of class: North Africa

French Guiana
type: Class
subclass of: Country
subclass of: South America
comment: Country/country-like geography class. Document-parsed mentions of this geography can be instantiated as members of this class.
ISO 3166-1 alpha-2 code: GF
ISO 3166-1 alpha-3 code: GUF
source subregion name: South America
source region name: Americas
part of class: South America

Turkey
type: Class
subclass of: Country
subclass of: Middle East
subclass of: Europe
comment: Country/country-like geography class. Document-parsed mentions of this geography can be instantiated as members of this class.
comment: Modeled as transcontinental for retrieval: Turkey is under MiddleEast/Asia and also directly under Europe.
ISO 3166-1 alpha-2 code: TR
ISO 3166-1 alpha-3 code: TUR
source subregion name: Western Asia
source region name: Asia
part of class: Middle East

Melanesia
type: Class
subclass of: Region
subclass of: Oceania
part of class: Oceania

Burkina Faso
type: Class
subclass of: Country
subclass of: West Africa
comment: Country/country-like geography class. Document-parsed mentions of this geography can be instantiated as members of this class.
ISO 3166-1 alpha-2 code: BF
ISO 3166-1 alpha-3 code: BFA
source subregion name: Western Africa
source region name: Africa
part of class: West Africa

East Asia
type: Class
subclass of: Region
subclass of: Asia
part of class: Asia

Kyrgyzstan
type: Class
subclass of: Country
subclass of: Central Asia
comment: Country/country-like geography class. Document-parsed mentions of this geography can be instantiated as members of this class.
ISO 3166-1 alpha-2 code: KG
ISO 3166-1 alpha-3 code: KGZ
source subregion name: Central Asia
source region name: Asia
part of class: Central Asia

Republic of the Congo
type: Class
subclass of: Country
subclass of: Central Africa
comment: Country/country-like geography class. Document-parsed mentions of this geography can be instantiated as members of this class.
ISO 3166-1 alpha-2 code: CG
ISO 3166-1 alpha-3 code: COG
source subregion name: Middle Africa
source region name: Africa
part of class: Central Africa

Antigua and Barbuda
type: Class
subclass of: Country
subclass of: Caribbean
comment: Country/country-like geography class. Document-parsed mentions of this geography can be instantiated as members of this class.
ISO 3166-1 alpha-2 code: AG
ISO 3166-1 alpha-3 code: ATG
source subregion name: Caribbean
source region name: Americas
part of class: Caribbean

Trinidad and Tobago
type: Class
subclass of: Country
subclass of: Caribbean
comment: Country/country-like geography class. Document-parsed mentions of this geography can be instantiated as members of this class.
ISO 3166-1 alpha-2 code: TT
ISO 3166-1 alpha-3 code: TTO
source subregion name: Caribbean
source region name: Americas
part of class: Caribbean

Svalbard and Jan Mayen
type: Class
subclass of: Country
subclass of: Northern Europe
comment: Country/country-like geography class. Document-parsed mentions of this geography can be instantiated as members of this class.
ISO 3166-1 alpha-2 code: SJ
ISO 3166-1 alpha-3 code: SJM
source subregion name: Northern Europe
source region name: Europe
part of class: Northern Europe

Dominica
type: Class
subclass of: Country
subclass of: Caribbean
comment: Country/country-like geography class. Document-parsed mentions of this geography can be instantiated as members of this class.
ISO 3166-1 alpha-2 code: DM
ISO 3166-1 alpha-3 code: DMA
source subregion name: Caribbean
source region name: Americas
part of class: Caribbean

Latvia
type: Class
subclass of: Country
subclass of: Northern Europe
comment: Country/country-like geography class. Document-parsed mentions of this geography can be instantiated as members of this class.
ISO 3166-1 alpha-2 code: LV
ISO 3166-1 alpha-3 code: LVA
source subregion name: Northern Europe
source region name: Europe
part of class: Northern Europe

Guinea
type: Class
subclass of: Country
subclass of: West Africa
comment: Country/country-like geography class. Document-parsed mentions of this geography can be instantiated as members of this class.
ISO 3166-1 alpha-2 code: GN
ISO 3166-1 alpha-3 code: GIN
source subregion name: Western Africa
source region name: Africa
part of class: West Africa

Lesotho
type: Class
subclass of: Country
subclass of: Southern Africa
comment: Country/country-like geography class. Document-parsed mentions of this geography can be instantiated as members of this class.
ISO 3166-1 alpha-2 code: LS
ISO 3166-1 alpha-3 code: LSO
source subregion name: Southern Africa
source region name: Africa
part of class: Southern Africa

Middle East
type: Class
subclass of: Region
subclass of: Asia
part of class: Asia
comment: Modeled as the user-facing regional class for Western Asia / Middle East. Adjust country membership if your project uses a narrower political definition of the Middle East.
comment: This ontology uses a broad/common geopolitical interpretation of Middle East, not strict UN M49 statistical regions. Iran, Turkey, and Egypt may be included for retrieval purposes.

Australia
type: Class
subclass of: Country
subclass of: Australia And New Zealand
comment: Country/country-like geography class. Document-parsed mentions of this geography can be instantiated as members of this class.
ISO 3166-1 alpha-2 code: AU
ISO 3166-1 alpha-3 code: AUS
source subregion name: Australia and New Zealand
source region name: Oceania
part of class: Australia And New Zealand

French Polynesia
type: Class
subclass of: Country
subclass of: Polynesia
comment: Country/country-like geography class. Document-parsed mentions of this geography can be instantiated as members of this class.
ISO 3166-1 alpha-2 code: PF
ISO 3166-1 alpha-3 code: PYF
source subregion name: Polynesia
source region name: Oceania
part of class: Polynesia

Samoa
type: Class
subclass of: Country
subclass of: Polynesia
comment: Country/country-like geography class. Document-parsed mentions of this geography can be instantiated as members of this class.
ISO 3166-1 alpha-2 code: WS
ISO 3166-1 alpha-3 code: WSM
source subregion name: Polynesia
source region name: Oceania
part of class: Polynesia

Niue
type: Class
subclass of: Country
subclass of: Polynesia
comment: Country/country-like geography class. Document-parsed mentions of this geography can be instantiated as members of this class.
ISO 3166-1 alpha-2 code: NU
ISO 3166-1 alpha-3 code: NIU
source subregion name: Polynesia
source region name: Oceania
part of class: Polynesia

North And South America
type: Class
subclass of: Continent

Guadeloupe
type: Class
subclass of: Country
subclass of: Caribbean
comment: Country/country-like geography class. Document-parsed mentions of this geography can be instantiated as members of this class.
ISO 3166-1 alpha-2 code: GP
ISO 3166-1 alpha-3 code: GLP
source subregion name: Caribbean
source region name: Americas
part of class: Caribbean

Federated States of Micronesia
type: Class
subclass of: Country
subclass of: Micronesia
comment: Country/country-like geography class. Document-parsed mentions of this geography can be instantiated as members of this class.
ISO 3166-1 alpha-2 code: FM
ISO 3166-1 alpha-3 code: FSM
source subregion name: Micronesia
source region name: Oceania
part of class: Micronesia

Grenada
type: Class
subclass of: Country
subclass of: Caribbean
comment: Country/country-like geography class. Document-parsed mentions of this geography can be instantiated as members of this class.
ISO 3166-1 alpha-2 code: GD
ISO 3166-1 alpha-3 code: GRD
source subregion name: Caribbean
source region name: Americas
part of class: Caribbean

Djibouti
type: Class
subclass of: Country
subclass of: East Africa
comment: Country/country-like geography class. Document-parsed mentions of this geography can be instantiated as members of this class.
ISO 3166-1 alpha-2 code: DJ
ISO 3166-1 alpha-3 code: DJI
source subregion name: Eastern Africa
source region name: Africa
part of class: East Africa

Honduras
type: Class
subclass of: Country
subclass of: Central America
comment: Country/country-like geography class. Document-parsed mentions of this geography can be instantiated as members of this class.
ISO 3166-1 alpha-2 code: HN
ISO 3166-1 alpha-3 code: HND
source subregion name: Central America
source region name: Americas
part of class: Central America

Lithuania
type: Class
subclass of: Country
subclass of: Northern Europe
comment: Country/country-like geography class. Document-parsed mentions of this geography can be instantiated as members of this class.
ISO 3166-1 alpha-2 code: LT
ISO 3166-1 alpha-3 code: LTU
source subregion name: Northern Europe
source region name: Europe
part of class: Northern Europe

Greece
type: Class
subclass of: Country
subclass of: Southern Europe
comment: Country/country-like geography class. Document-parsed mentions of this geography can be instantiated as members of this class.
ISO 3166-1 alpha-2 code: GR
ISO 3166-1 alpha-3 code: GRC
source subregion name: Southern Europe
source region name: Europe
part of class: Southern Europe

Sri Lanka
type: Class
subclass of: Country
subclass of: South Asia
comment: Country/country-like geography class. Document-parsed mentions of this geography can be instantiated as members of this class.
ISO 3166-1 alpha-2 code: LK
ISO 3166-1 alpha-3 code: LKA
source subregion name: Southern Asia
source region name: Asia
part of class: South Asia

Bosnia and Herzegovina
type: Class
subclass of: Country
subclass of: Southern Europe
comment: Country/country-like geography class. Document-parsed mentions of this geography can be instantiated as members of this class.
ISO 3166-1 alpha-2 code: BA
ISO 3166-1 alpha-3 code: BIH
source subregion name: Southern Europe
source region name: Europe
part of class: Southern Europe

Jordan
type: Class
subclass of: Country
subclass of: Middle East
comment: Country/country-like geography class. Document-parsed mentions of this geography can be instantiated as members of this class.
ISO 3166-1 alpha-2 code: JO
ISO 3166-1 alpha-3 code: JOR
source subregion name: Western Asia
source region name: Asia
part of class: Middle East

Cyprus
type: Class
subclass of: Country
subclass of: Southern Europe
comment: Country/country-like geography class. Document-parsed mentions of this geography can be instantiated as members of this class.
ISO 3166-1 alpha-2 code: CY
ISO 3166-1 alpha-3 code: CYP
source subregion name: Southern Europe
source region name: Europe
part of class: Southern Europe

Solomon Islands
type: Class
subclass of: Country
subclass of: Melanesia
comment: Country/country-like geography class. Document-parsed mentions of this geography can be instantiated as members of this class.
ISO 3166-1 alpha-2 code: SB
ISO 3166-1 alpha-3 code: SLB
source subregion name: Melanesia
source region name: Oceania
part of class: Melanesia

Russia
type: Class
subclass of: Country
subclass of: Eastern Europe
subclass of: Asia
comment: Country/country-like geography class. Document-parsed mentions of this geography can be instantiated as members of this class.
comment: Modeled as transcontinental for retrieval: Russia is under EasternEurope/Europe and also directly under Asia.
ISO 3166-1 alpha-2 code: RU
ISO 3166-1 alpha-3 code: RUS
source subregion name: Eastern Europe
source region name: Europe
part of class: Eastern Europe

Germany
type: Class
subclass of: Country
subclass of: Western Europe
comment: Country/country-like geography class. Document-parsed mentions of this geography can be instantiated as members of this class.
ISO 3166-1 alpha-2 code: DE
ISO 3166-1 alpha-3 code: DEU
source subregion name: Western Europe
source region name: Europe
part of class: Western Europe

Israel
type: Class
subclass of: Country
subclass of: Middle East
comment: Country/country-like geography class. Document-parsed mentions of this geography can be instantiated as members of this class.
ISO 3166-1 alpha-2 code: IL
ISO 3166-1 alpha-3 code: ISR
source subregion name: Western Asia
source region name: Asia
part of class: Middle East

Glorioso Islands
type: Class
subclass of: Country
comment: Country/country-like geography class. Document-parsed mentions of this geography can be instantiated as members of this class.

Republic of Macedonia
type: Class
subclass of: Country
subclass of: Southern Europe
comment: Country/country-like geography class. Document-parsed mentions of this geography can be instantiated as members of this class.
ISO 3166-1 alpha-2 code: MK
ISO 3166-1 alpha-3 code: MKD
source subregion name: Southern Europe
source region name: Europe
part of class: Southern Europe

Malawi
type: Class
subclass of: Country
subclass of: East Africa
comment: Country/country-like geography class. Document-parsed mentions of this geography can be instantiated as members of this class.
ISO 3166-1 alpha-2 code: MW
ISO 3166-1 alpha-3 code: MWI
source subregion name: Eastern Africa
source region name: Africa
part of class: East Africa

Hong Kong
type: Class
subclass of: Country
subclass of: East Asia
comment: Country/country-like geography class. Document-parsed mentions of this geography can be instantiated as members of this class.
ISO 3166-1 alpha-2 code: HK
ISO 3166-1 alpha-3 code: HKG
source subregion name: Eastern Asia
source region name: Asia
part of class: East Asia

Guatemala
type: Class
subclass of: Country
subclass of: Central America
comment: Country/country-like geography class. Document-parsed mentions of this geography can be instantiated as members of this class.
ISO 3166-1 alpha-2 code: GT
ISO 3166-1 alpha-3 code: GTM
source subregion name: Central America
source region name: Americas
part of class: Central America

Hungary
type: Class
subclass of: Country
subclass of: Eastern Europe
comment: Country/country-like geography class. Document-parsed mentions of this geography can be instantiated as members of this class.
ISO 3166-1 alpha-2 code: HU
ISO 3166-1 alpha-3 code: HUN
source subregion name: Eastern Europe
source region name: Europe
part of class: Eastern Europe

Benin
type: Class
subclass of: Country
subclass of: West Africa
comment: Country/country-like geography class. Document-parsed mentions of this geography can be instantiated as members of this class.
ISO 3166-1 alpha-2 code: BJ
ISO 3166-1 alpha-3 code: BEN
source subregion name: Western Africa
source region name: Africa
part of class: West Africa

Equatorial Guinea
type: Class
subclass of: Country
subclass of: Central Africa
comment: Country/country-like geography class. Document-parsed mentions of this geography can be instantiated as members of this class.
ISO 3166-1 alpha-2 code: GQ
ISO 3166-1 alpha-3 code: GNQ
source subregion name: Middle Africa
source region name: Africa
part of class: Central Africa

India
type: Class
subclass of: Country
subclass of: South Asia
comment: Country/country-like geography class. Document-parsed mentions of this geography can be instantiated as members of this class.
ISO 3166-1 alpha-2 code: IN
ISO 3166-1 alpha-3 code: IND
source subregion name: Southern Asia
source region name: Asia
part of class: South Asia

Vietnam
type: Class
subclass of: Country
subclass of: Southeast Asia
comment: Country/country-like geography class. Document-parsed mentions of this geography can be instantiated as members of this class.
ISO 3166-1 alpha-2 code: VN
ISO 3166-1 alpha-3 code: VNM
source subregion name: South-Eastern Asia
source region name: Asia
part of class: Southeast Asia

United Kingdom
type: Class
subclass of: Country
subclass of: Northern Europe
comment: Country/country-like geography class. Document-parsed mentions of this geography can be instantiated as members of this class.
ISO 3166-1 alpha-2 code: GB
ISO 3166-1 alpha-3 code: GBR
source subregion name: Northern Europe
source region name: Europe
part of class: Northern Europe

Afghanistan
type: Class
subclass of: Country
subclass of: South Asia
comment: Country/country-like geography class. Document-parsed mentions of this geography can be instantiated as members of this class.
ISO 3166-1 alpha-2 code: AF
ISO 3166-1 alpha-3 code: AFG
source subregion name: Southern Asia
source region name: Asia
part of class: South Asia

Belize
type: Class
subclass of: Country
subclass of: Central America
comment: Country/country-like geography class. Document-parsed mentions of this geography can be instantiated as members of this class.
ISO 3166-1 alpha-2 code: BZ
ISO 3166-1 alpha-3 code: BLZ
source subregion name: Central America
source region name: Americas
part of class: Central America

Clipperton Island
type: Class
subclass of: Country
comment: Country/country-like geography class. Document-parsed mentions of this geography can be instantiated as members of this class.

Papua New Guinea
type: Class
subclass of: Country
subclass of: Melanesia
comment: Country/country-like geography class. Document-parsed mentions of this geography can be instantiated as members of this class.
ISO 3166-1 alpha-2 code: PG
ISO 3166-1 alpha-3 code: PNG
source subregion name: Melanesia
source region name: Oceania
part of class: Melanesia

Panama
type: Class
subclass of: Country
subclass of: Central America
comment: Country/country-like geography class. Document-parsed mentions of this geography can be instantiated as members of this class.
ISO 3166-1 alpha-2 code: PA
ISO 3166-1 alpha-3 code: PAN
source subregion name: Central America
source region name: Americas
part of class: Central America

Netherlands
type: Class
subclass of: Country
subclass of: Western Europe
comment: Country/country-like geography class. Document-parsed mentions of this geography can be instantiated as members of this class.
ISO 3166-1 alpha-2 code: NL
ISO 3166-1 alpha-3 code: NLD
source subregion name: Western Europe
source region name: Europe
part of class: Western Europe

Faroe Islands
type: Class
subclass of: Country
subclass of: Northern Europe
comment: Country/country-like geography class. Document-parsed mentions of this geography can be instantiated as members of this class.
ISO 3166-1 alpha-2 code: FO
ISO 3166-1 alpha-3 code: FRO
source subregion name: Northern Europe
source region name: Europe
part of class: Northern Europe

Cayman Islands
type: Class
subclass of: Country
subclass of: Caribbean
comment: Country/country-like geography class. Document-parsed mentions of this geography can be instantiated as members of this class.
ISO 3166-1 alpha-2 code: KY
ISO 3166-1 alpha-3 code: CYM
source subregion name: Caribbean
source region name: Americas
part of class: Caribbean

São Tomé and Príncipe
type: Class
subclass of: Country
subclass of: Central Africa
comment: Country/country-like geography class. Document-parsed mentions of this geography can be instantiated as members of this class.
ISO 3166-1 alpha-2 code: ST
ISO 3166-1 alpha-3 code: STP
source subregion name: Middle Africa
source region name: Africa
part of class: Central Africa

Mauritania
type: Class
subclass of: Country
subclass of: West Africa
comment: Country/country-like geography class. Document-parsed mentions of this geography can be instantiated as members of this class.
ISO 3166-1 alpha-2 code: MR
ISO 3166-1 alpha-3 code: MRT
source subregion name: Western Africa
source region name: Africa
part of class: West Africa

Luxembourg
type: Class
subclass of: Country
subclass of: Western Europe
comment: Country/country-like geography class. Document-parsed mentions of this geography can be instantiated as members of this class.
ISO 3166-1 alpha-2 code: LU
ISO 3166-1 alpha-3 code: LUX
source subregion name: Western Europe
source region name: Europe
part of class: Western Europe

Mexico
type: Class
subclass of: Country
subclass of: Central America
comment: Country/country-like geography class. Document-parsed mentions of this geography can be instantiated as members of this class.
ISO 3166-1 alpha-2 code: MX
ISO 3166-1 alpha-3 code: MEX
source subregion name: Central America
source region name: Americas
part of class: Central America

Colombia
type: Class
subclass of: Country
subclass of: South America
comment: Country/country-like geography class. Document-parsed mentions of this geography can be instantiated as members of this class.
ISO 3166-1 alpha-2 code: CO
ISO 3166-1 alpha-3 code: COL
source subregion name: South America
source region name: Americas
part of class: South America

Finland
type: Class
subclass of: Country
subclass of: Northern Europe
comment: Country/country-like geography class. Document-parsed mentions of this geography can be instantiated as members of this class.
ISO 3166-1 alpha-2 code: FI
ISO 3166-1 alpha-3 code: FIN
source subregion name: Northern Europe
source region name: Europe
part of class: Northern Europe

Denmark
type: Class
subclass of: Country
subclass of: Northern Europe
comment: Country/country-like geography class. Document-parsed mentions of this geography can be instantiated as members of this class.
ISO 3166-1 alpha-2 code: DK
ISO 3166-1 alpha-3 code: DNK
source subregion name: Northern Europe
source region name: Europe
part of class: Northern Europe

Angola
type: Class
subclass of: Country
subclass of: Central Africa
comment: Country/country-like geography class. Document-parsed mentions of this geography can be instantiated as members of this class.
ISO 3166-1 alpha-2 code: AO
ISO 3166-1 alpha-3 code: AGO
source subregion name: Middle Africa
source region name: Africa
part of class: Central Africa

Estonia
type: Class
subclass of: Country
subclass of: Northern Europe
comment: Country/country-like geography class. Document-parsed mentions of this geography can be instantiated as members of this class.
ISO 3166-1 alpha-2 code: EE
ISO 3166-1 alpha-3 code: EST
source subregion name: Northern Europe
source region name: Europe
part of class: Northern Europe

Oman
type: Class
subclass of: Country
subclass of: Middle East
comment: Country/country-like geography class. Document-parsed mentions of this geography can be instantiated as members of this class.
ISO 3166-1 alpha-2 code: OM
ISO 3166-1 alpha-3 code: OMN
source subregion name: Western Asia
source region name: Asia
part of class: Middle East

Jarvis Island
type: Class
subclass of: Country
comment: Country/country-like geography class. Document-parsed mentions of this geography can be instantiated as members of this class.

Pitcairn Islands
type: Class
subclass of: Country
subclass of: Polynesia
comment: Country/country-like geography class. Document-parsed mentions of this geography can be instantiated as members of this class.
ISO 3166-1 alpha-2 code: PN
ISO 3166-1 alpha-3 code: PCN
source subregion name: Polynesia
source region name: Oceania
part of class: Polynesia

Bangladesh
type: Class
subclass of: Country
subclass of: South Asia
comment: Country/country-like geography class. Document-parsed mentions of this geography can be instantiated as members of this class.
ISO 3166-1 alpha-2 code: BD
ISO 3166-1 alpha-3 code: BGD
source subregion name: Southern Asia
source region name: Asia
part of class: South Asia

South Korea
type: Class
subclass of: Country
subclass of: East Asia
comment: Country/country-like geography class. Document-parsed mentions of this geography can be instantiated as members of this class.
ISO 3166-1 alpha-2 code: KR
ISO 3166-1 alpha-3 code: KOR
source subregion name: Eastern Asia
source region name: Asia
part of class: East Asia

Kuwait
type: Class
subclass of: Country
subclass of: Middle East
comment: Country/country-like geography class. Document-parsed mentions of this geography can be instantiated as members of this class.
ISO 3166-1 alpha-2 code: KW
ISO 3166-1 alpha-3 code: KWT
source subregion name: Western Asia
source region name: Asia
part of class: Middle East

Bhutan
type: Class
subclass of: Country
subclass of: South Asia
comment: Country/country-like geography class. Document-parsed mentions of this geography can be instantiated as members of this class.
ISO 3166-1 alpha-2 code: BT
ISO 3166-1 alpha-3 code: BTN
source subregion name: Southern Asia
source region name: Asia
part of class: South Asia

Italy
type: Class
subclass of: Country
subclass of: Southern Europe
comment: Country/country-like geography class. Document-parsed mentions of this geography can be instantiated as members of this class.
ISO 3166-1 alpha-2 code: IT
ISO 3166-1 alpha-3 code: ITA
source subregion name: Southern Europe
source region name: Europe
part of class: Southern Europe

Mali
type: Class
subclass of: Country
subclass of: West Africa
comment: Country/country-like geography class. Document-parsed mentions of this geography can be instantiated as members of this class.
ISO 3166-1 alpha-2 code: ML
ISO 3166-1 alpha-3 code: MLI
source subregion name: Western Africa
source region name: Africa
part of class: West Africa

Thailand
type: Class
subclass of: Country
subclass of: Southeast Asia
comment: Country/country-like geography class. Document-parsed mentions of this geography can be instantiated as members of this class.
ISO 3166-1 alpha-2 code: TH
ISO 3166-1 alpha-3 code: THA
source subregion name: South-Eastern Asia
source region name: Asia
part of class: Southeast Asia

Dominican Republic
type: Class
subclass of: Country
subclass of: Caribbean
comment: Country/country-like geography class. Document-parsed mentions of this geography can be instantiated as members of this class.
ISO 3166-1 alpha-2 code: DO
ISO 3166-1 alpha-3 code: DOM
source subregion name: Caribbean
source region name: Americas
part of class: Caribbean

Guyana
type: Class
subclass of: Country
subclass of: South America
comment: Country/country-like geography class. Document-parsed mentions of this geography can be instantiated as members of this class.
ISO 3166-1 alpha-2 code: GY
ISO 3166-1 alpha-3 code: GUY
source subregion name: South America
source region name: Americas
part of class: South America

Montserrat
type: Class
subclass of: Country
subclass of: Caribbean
comment: Country/country-like geography class. Document-parsed mentions of this geography can be instantiated as members of this class.
ISO 3166-1 alpha-2 code: MS
ISO 3166-1 alpha-3 code: MSR
source subregion name: Caribbean
source region name: Americas
part of class: Caribbean

Palau
type: Class
subclass of: Country
subclass of: Micronesia
comment: Country/country-like geography class. Document-parsed mentions of this geography can be instantiated as members of this class.
ISO 3166-1 alpha-2 code: PW
ISO 3166-1 alpha-3 code: PLW
source subregion name: Micronesia
source region name: Oceania
part of class: Micronesia

Liberia
type: Class
subclass of: Country
subclass of: West Africa
comment: Country/country-like geography class. Document-parsed mentions of this geography can be instantiated as members of this class.
ISO 3166-1 alpha-2 code: LR
ISO 3166-1 alpha-3 code: LBR
source subregion name: Western Africa
source region name: Africa
part of class: West Africa

Indonesia
type: Class
subclass of: Country
subclass of: Southeast Asia
comment: Country/country-like geography class. Document-parsed mentions of this geography can be instantiated as members of this class.
ISO 3166-1 alpha-2 code: ID
ISO 3166-1 alpha-3 code: IDN
source subregion name: South-Eastern Asia
source region name: Asia
part of class: Southeast Asia

Micronesia
type: Class
subclass of: Region
subclass of: Oceania
part of class: Oceania

Saint Lucia
type: Class
subclass of: Country
subclass of: Caribbean
comment: Country/country-like geography class. Document-parsed mentions of this geography can be instantiated as members of this class.
ISO 3166-1 alpha-2 code: LC
ISO 3166-1 alpha-3 code: LCA
source subregion name: Caribbean
source region name: Americas
part of class: Caribbean

Swaziland
type: Class
subclass of: Country
subclass of: Southern Africa
comment: Country/country-like geography class. Document-parsed mentions of this geography can be instantiated as members of this class.
ISO 3166-1 alpha-2 code: SZ
ISO 3166-1 alpha-3 code: SWZ
source subregion name: Southern Africa
source region name: Africa
part of class: Southern Africa

part of
type: ObjectProperty
comment: Instance-level relation for geography individuals or document mentions.

Comoros
type: Class
subclass of: Country
subclass of: East Africa
comment: Country/country-like geography class. Document-parsed mentions of this geography can be instantiated as members of this class.
ISO 3166-1 alpha-2 code: KM
ISO 3166-1 alpha-3 code: COM
source subregion name: Eastern Africa
source region name: Africa
part of class: East Africa

Austria
type: Class
subclass of: Country
subclass of: Western Europe
comment: Country/country-like geography class. Document-parsed mentions of this geography can be instantiated as members of this class.
ISO 3166-1 alpha-2 code: AT
ISO 3166-1 alpha-3 code: AUT
source subregion name: Western Europe
source region name: Europe
part of class: Western Europe

Iceland
type: Class
subclass of: Country
subclass of: Northern Europe
comment: Country/country-like geography class. Document-parsed mentions of this geography can be instantiated as members of this class.
ISO 3166-1 alpha-2 code: IS
ISO 3166-1 alpha-3 code: ISL
source subregion name: Northern Europe
source region name: Europe
part of class: Northern Europe

Ghana
type: Class
subclass of: Country
subclass of: West Africa
comment: Country/country-like geography class. Document-parsed mentions of this geography can be instantiated as members of this class.
ISO 3166-1 alpha-2 code: GH
ISO 3166-1 alpha-3 code: GHA
source subregion name: Western Africa
source region name: Africa
part of class: West Africa

Belarus
type: Class
subclass of: Country
subclass of: Eastern Europe
comment: Country/country-like geography class. Document-parsed mentions of this geography can be instantiated as members of this class.
ISO 3166-1 alpha-2 code: BY
ISO 3166-1 alpha-3 code: BLR
source subregion name: Eastern Europe
source region name: Europe
part of class: Eastern Europe

Saint Pierre and Miquelon
type: Class
subclass of: Country
subclass of: North America
comment: Country/country-like geography class. Document-parsed mentions of this geography can be instantiated as members of this class.
ISO 3166-1 alpha-2 code: PM
ISO 3166-1 alpha-3 code: SPM
source subregion name: Northern America
source region name: Americas
part of class: North America

New Caledonia
type: Class
subclass of: Country
subclass of: Melanesia
comment: Country/country-like geography class. Document-parsed mentions of this geography can be instantiated as members of this class.
ISO 3166-1 alpha-2 code: NC
ISO 3166-1 alpha-3 code: NCL
source subregion name: Melanesia
source region name: Oceania
part of class: Melanesia

Ecuador
type: Class
subclass of: Country
subclass of: South America
comment: Country/country-like geography class. Document-parsed mentions of this geography can be instantiated as members of this class.
ISO 3166-1 alpha-2 code: EC
ISO 3166-1 alpha-3 code: ECU
source subregion name: South America
source region name: Americas
part of class: South America

Somalia
type: Class
subclass of: Country
subclass of: East Africa
comment: Country/country-like geography class. Document-parsed mentions of this geography can be instantiated as members of this class.
ISO 3166-1 alpha-2 code: SO
ISO 3166-1 alpha-3 code: SOM
source subregion name: Eastern Africa
source region name: Africa
part of class: East Africa

Virgin Islands
type: Class
subclass of: Country
comment: Country/country-like geography class. Document-parsed mentions of this geography can be instantiated as members of this class.

Norfolk Island
type: Class
subclass of: Country
subclass of: Australia And New Zealand
comment: Country/country-like geography class. Document-parsed mentions of this geography can be instantiated as members of this class.
ISO 3166-1 alpha-2 code: NF
ISO 3166-1 alpha-3 code: NFK
source subregion name: Australia and New Zealand
source region name: Oceania
part of class: Australia And New Zealand

Iraq
type: Class
subclass of: Country
subclass of: Middle East
comment: Country/country-like geography class. Document-parsed mentions of this geography can be instantiated as members of this class.
ISO 3166-1 alpha-2 code: IQ
ISO 3166-1 alpha-3 code: IRQ
source subregion name: Western Asia
source region name: Asia
part of class: Middle East

Johnston Atoll
type: Class
subclass of: Country
comment: Country/country-like geography class. Document-parsed mentions of this geography can be instantiated as members of this class.

Polynesia
type: Class
subclass of: Region
subclass of: Oceania
part of class: Oceania

Suriname
type: Class
subclass of: Country
subclass of: South America
comment: Country/country-like geography class. Document-parsed mentions of this geography can be instantiated as members of this class.
ISO 3166-1 alpha-2 code: SR
ISO 3166-1 alpha-3 code: SUR
source subregion name: South America
source region name: Americas
part of class: South America

Argentina
type: Class
subclass of: Country
subclass of: South America
comment: Country/country-like geography class. Document-parsed mentions of this geography can be instantiated as members of this class.
ISO 3166-1 alpha-2 code: AR
ISO 3166-1 alpha-3 code: ARG
source subregion name: South America
source region name: Americas
part of class: South America

Cameroon
type: Class
subclass of: Country
subclass of: Central Africa
comment: Country/country-like geography class. Document-parsed mentions of this geography can be instantiated as members of this class.
ISO 3166-1 alpha-2 code: CM
ISO 3166-1 alpha-3 code: CMR
source subregion name: Middle Africa
source region name: Africa
part of class: Central Africa

ISO 3166-1 alpha-3 code
type: AnnotationProperty

United Arab Emirates
type: Class
subclass of: Country
subclass of: Middle East
comment: Country/country-like geography class. Document-parsed mentions of this geography can be instantiated as members of this class.
ISO 3166-1 alpha-2 code: AE
ISO 3166-1 alpha-3 code: ARE
source subregion name: Western Asia
source region name: Asia
part of class: Middle East

China
type: Class
subclass of: Country
subclass of: East Asia
comment: Country/country-like geography class. Document-parsed mentions of this geography can be instantiated as members of this class.
ISO 3166-1 alpha-2 code: CN
ISO 3166-1 alpha-3 code: CHN
source subregion name: Eastern Asia
source region name: Asia
part of class: East Asia

Liechtenstein
type: Class
subclass of: Country
subclass of: Western Europe
comment: Country/country-like geography class. Document-parsed mentions of this geography can be instantiated as members of this class.
ISO 3166-1 alpha-2 code: LI
ISO 3166-1 alpha-3 code: LIE
source subregion name: Western Europe
source region name: Europe
part of class: Western Europe

Yemen
type: Class
subclass of: Country
subclass of: Middle East
comment: Country/country-like geography class. Document-parsed mentions of this geography can be instantiated as members of this class.
ISO 3166-1 alpha-2 code: YE
ISO 3166-1 alpha-3 code: YEM
source subregion name: Western Asia
source region name: Asia
part of class: Middle East

Europa Island
type: Class
subclass of: Country
comment: Country/country-like geography class. Document-parsed mentions of this geography can be instantiated as members of this class.

Wales
type: Class
subclass of: Country
comment: Country/country-like geography class. Document-parsed mentions of this geography can be instantiated as members of this class.
ISO 3166-1 alpha-2 code: GB
ISO 3166-1 alpha-3 code: GBR

Togo
type: Class
subclass of: Country
subclass of: West Africa
comment: Country/country-like geography class. Document-parsed mentions of this geography can be instantiated as members of this class.
ISO 3166-1 alpha-2 code: TG
ISO 3166-1 alpha-3 code: TGO
source subregion name: Western Africa
source region name: Africa
part of class: West Africa

Nigeria
type: Class
subclass of: Country
subclass of: West Africa
comment: Country/country-like geography class. Document-parsed mentions of this geography can be instantiated as members of this class.
ISO 3166-1 alpha-2 code: NG
ISO 3166-1 alpha-3 code: NGA
source subregion name: Western Africa
source region name: Africa
part of class: West Africa

Kiribati
type: Class
subclass of: Country
subclass of: Micronesia
comment: Country/country-like geography class. Document-parsed mentions of this geography can be instantiated as members of this class.
ISO 3166-1 alpha-2 code: KI
ISO 3166-1 alpha-3 code: KIR
source subregion name: Micronesia
source region name: Oceania
part of class: Micronesia

Azerbaijan
type: Class
subclass of: Country
subclass of: Middle East
comment: Country/country-like geography class. Document-parsed mentions of this geography can be instantiated as members of this class.
ISO 3166-1 alpha-2 code: AZ
ISO 3166-1 alpha-3 code: AZE
source subregion name: Western Asia
source region name: Asia
part of class: Middle East

Scotland
type: Class
subclass of: Country
comment: Country/country-like geography class. Document-parsed mentions of this geography can be instantiated as members of this class.

Libya
type: Class
subclass of: Country
subclass of: North Africa
comment: Country/country-like geography class. Document-parsed mentions of this geography can be instantiated as members of this class.
ISO 3166-1 alpha-2 code: LY
ISO 3166-1 alpha-3 code: LBY
source subregion name: Northern Africa
source region name: Africa
part of class: North Africa

Serbia
type: Class
subclass of: Country
subclass of: Eastern Europe
comment: Country/country-like geography class. Document-parsed mentions of this geography can be instantiated as members of this class.
ISO 3166-1 alpha-2 code: RS
ISO 3166-1 alpha-3 code: SRB
source subregion name: Eastern Europe
source region name: Europe
part of class: Eastern Europe

Chad
type: Class
subclass of: Country
subclass of: Central Africa
comment: Country/country-like geography class. Document-parsed mentions of this geography can be instantiated as members of this class.
ISO 3166-1 alpha-2 code: TD
ISO 3166-1 alpha-3 code: TCD
source subregion name: Middle Africa
source region name: Africa
part of class: Central Africa

Ireland
type: Class
subclass of: Country
subclass of: Northern Europe
comment: Country/country-like geography class. Document-parsed mentions of this geography can be instantiated as members of this class.
ISO 3166-1 alpha-2 code: IE
ISO 3166-1 alpha-3 code: IRL
source subregion name: Northern Europe
source region name: Europe
part of class: Northern Europe

Kenya
type: Class
subclass of: Country
subclass of: East Africa
comment: Country/country-like geography class. Document-parsed mentions of this geography can be instantiated as members of this class.
ISO 3166-1 alpha-2 code: KE
ISO 3166-1 alpha-3 code: KEN
source subregion name: Eastern Africa
source region name: Africa
part of class: East Africa

Aruba
type: Class
subclass of: Country
subclass of: Caribbean
comment: Country/country-like geography class. Document-parsed mentions of this geography can be instantiated as members of this class.
ISO 3166-1 alpha-2 code: AW
ISO 3166-1 alpha-3 code: ABW
source subregion name: Caribbean
source region name: Americas
part of class: Caribbean

Ethiopia
type: Class
subclass of: Country
subclass of: East Africa
comment: Country/country-like geography class. Document-parsed mentions of this geography can be instantiated as members of this class.
ISO 3166-1 alpha-2 code: ET
ISO 3166-1 alpha-3 code: ETH
source subregion name: Eastern Africa
source region name: Africa
part of class: East Africa

Marshall Islands
type: Class
subclass of: Country
subclass of: Micronesia
comment: Country/country-like geography class. Document-parsed mentions of this geography can be instantiated as members of this class.
ISO 3166-1 alpha-2 code: MH
ISO 3166-1 alpha-3 code: MHL
source subregion name: Micronesia
source region name: Oceania
part of class: Micronesia

Western Sahara
type: Class
subclass of: Country
subclass of: North Africa
comment: Country/country-like geography class. Document-parsed mentions of this geography can be instantiated as members of this class.
ISO 3166-1 alpha-2 code: EH
ISO 3166-1 alpha-3 code: ESH
source subregion name: Northern Africa
source region name: Africa
part of class: North Africa

Zimbabwe
type: Class
subclass of: Country
subclass of: East Africa
comment: Country/country-like geography class. Document-parsed mentions of this geography can be instantiated as members of this class.
ISO 3166-1 alpha-2 code: ZW
ISO 3166-1 alpha-3 code: ZWE
source subregion name: Eastern Africa
source region name: Africa
part of class: East Africa

Martinique
type: Class
subclass of: Country
subclass of: Caribbean
comment: Country/country-like geography class. Document-parsed mentions of this geography can be instantiated as members of this class.
ISO 3166-1 alpha-2 code: MQ
ISO 3166-1 alpha-3 code: MTQ
source subregion name: Caribbean
source region name: Americas
part of class: Caribbean

Cook Islands
type: Class
subclass of: Country
subclass of: Polynesia
comment: Country/country-like geography class. Document-parsed mentions of this geography can be instantiated as members of this class.
ISO 3166-1 alpha-2 code: CK
ISO 3166-1 alpha-3 code: COK
source subregion name: Polynesia
source region name: Oceania
part of class: Polynesia

Slovenia
type: Class
subclass of: Country
subclass of: Southern Europe
comment: Country/country-like geography class. Document-parsed mentions of this geography can be instantiated as members of this class.
ISO 3166-1 alpha-2 code: SI
ISO 3166-1 alpha-3 code: SVN
source subregion name: Southern Europe
source region name: Europe
part of class: Southern Europe

Saint Kitts and Nevis
type: Class
subclass of: Country
subclass of: Caribbean
comment: Country/country-like geography class. Document-parsed mentions of this geography can be instantiated as members of this class.
ISO 3166-1 alpha-2 code: KN
ISO 3166-1 alpha-3 code: KNA
source subregion name: Caribbean
source region name: Americas
part of class: Caribbean

Northern Mariana Islands
type: Class
subclass of: Country
subclass of: Micronesia
comment: Country/country-like geography class. Document-parsed mentions of this geography can be instantiated as members of this class.
ISO 3166-1 alpha-2 code: MP
ISO 3166-1 alpha-3 code: MNP
source subregion name: Micronesia
source region name: Oceania
part of class: Micronesia

Nauru
type: Class
subclass of: Country
subclass of: Micronesia
comment: Country/country-like geography class. Document-parsed mentions of this geography can be instantiated as members of this class.
ISO 3166-1 alpha-2 code: NR
ISO 3166-1 alpha-3 code: NRU
source subregion name: Micronesia
source region name: Oceania
part of class: Micronesia

Cambodia
type: Class
subclass of: Country
subclass of: Southeast Asia
comment: Country/country-like geography class. Document-parsed mentions of this geography can be instantiated as members of this class.
ISO 3166-1 alpha-2 code: KH
ISO 3166-1 alpha-3 code: KHM
source subregion name: South-Eastern Asia
source region name: Asia
part of class: Southeast Asia

Greenland
type: Class
subclass of: Country
subclass of: North America
comment: Country/country-like geography class. Document-parsed mentions of this geography can be instantiated as members of this class.
ISO 3166-1 alpha-2 code: GL
ISO 3166-1 alpha-3 code: GRL
source subregion name: Northern America
source region name: Americas
part of class: North America

Burundi
type: Class
subclass of: Country
subclass of: East Africa
comment: Country/country-like geography class. Document-parsed mentions of this geography can be instantiated as members of this class.
ISO 3166-1 alpha-2 code: BI
ISO 3166-1 alpha-3 code: BDI
source subregion name: Eastern Africa
source region name: Africa
part of class: East Africa

Bahrain
type: Class
subclass of: Country
subclass of: Middle East
comment: Country/country-like geography class. Document-parsed mentions of this geography can be instantiated as members of this class.
ISO 3166-1 alpha-2 code: BH
ISO 3166-1 alpha-3 code: BHR
source subregion name: Western Asia
source region name: Asia
part of class: Middle East

South Georgia
type: Class
subclass of: Country
subclass of: South America
comment: Country/country-like geography class. Document-parsed mentions of this geography can be instantiated as members of this class.
ISO 3166-1 alpha-2 code: GS
ISO 3166-1 alpha-3 code: SGS
source subregion name: South America
source region name: Americas
part of class: South America

France
type: Class
subclass of: Country
subclass of: Western Europe
comment: Country/country-like geography class. Document-parsed mentions of this geography can be instantiated as members of this class.
ISO 3166-1 alpha-2 code: FR
ISO 3166-1 alpha-3 code: FRA
source subregion name: Western Europe
source region name: Europe
part of class: Western Europe

Eritrea
type: Class
subclass of: Country
subclass of: East Africa
comment: Country/country-like geography class. Document-parsed mentions of this geography can be instantiated as members of this class.
ISO 3166-1 alpha-2 code: ER
ISO 3166-1 alpha-3 code: ERI
source subregion name: Eastern Africa
source region name: Africa
part of class: East Africa

Botswana
type: Class
subclass of: Country
subclass of: Southern Africa
comment: Country/country-like geography class. Document-parsed mentions of this geography can be instantiated as members of this class.
ISO 3166-1 alpha-2 code: BW
ISO 3166-1 alpha-3 code: BWA
source subregion name: Southern Africa
source region name: Africa
part of class: Southern Africa

Malta
type: Class
subclass of: Country
subclass of: Southern Europe
comment: Country/country-like geography class. Document-parsed mentions of this geography can be instantiated as members of this class.
ISO 3166-1 alpha-2 code: MT
ISO 3166-1 alpha-3 code: MLT
source subregion name: Southern Europe
source region name: Europe
part of class: Southern Europe

Rwanda
type: Class
subclass of: Country
subclass of: East Africa
comment: Country/country-like geography class. Document-parsed mentions of this geography can be instantiated as members of this class.
ISO 3166-1 alpha-2 code: RW
ISO 3166-1 alpha-3 code: RWA
source subregion name: Eastern Africa
source region name: Africa
part of class: East Africa

Pakistan
type: Class
subclass of: Country
subclass of: South Asia
comment: Country/country-like geography class. Document-parsed mentions of this geography can be instantiated as members of this class.
ISO 3166-1 alpha-2 code: PK
ISO 3166-1 alpha-3 code: PAK
source subregion name: Southern Asia
source region name: Asia
part of class: South Asia

Laos
type: Class
subclass of: Country
subclass of: Southeast Asia
comment: Country/country-like geography class. Document-parsed mentions of this geography can be instantiated as members of this class.
ISO 3166-1 alpha-2 code: LA
ISO 3166-1 alpha-3 code: LAO
source subregion name: South-Eastern Asia
source region name: Asia
part of class: Southeast Asia

Central Asia
type: Class
subclass of: Region
subclass of: Asia
part of class: Asia

Asia
type: Class
subclass of: Continent

Fiji
type: Class
subclass of: Country
subclass of: Melanesia
comment: Country/country-like geography class. Document-parsed mentions of this geography can be instantiated as members of this class.
ISO 3166-1 alpha-2 code: FJ
ISO 3166-1 alpha-3 code: FJI
source subregion name: Melanesia
source region name: Oceania
part of class: Melanesia

South Africa
type: Class
subclass of: Country
subclass of: Southern Africa
comment: Country/country-like geography class. Document-parsed mentions of this geography can be instantiated as members of this class.
ISO 3166-1 alpha-2 code: ZA
ISO 3166-1 alpha-3 code: ZAF
source subregion name: Southern Africa
source region name: Africa
part of class: Southern Africa

The Bahamas
type: Class
subclass of: Country
subclass of: Caribbean
comment: Country/country-like geography class. Document-parsed mentions of this geography can be instantiated as members of this class.
ISO 3166-1 alpha-2 code: BS
ISO 3166-1 alpha-3 code: BHS
source subregion name: Caribbean
source region name: Americas
part of class: Caribbean

Veerla Ram Rao Geography Ontology
type: Ontology
description: A class-based geography ontology for GraphRAG/document parsing. Specific continents, regions, and countries are modeled as OWL classes so document-derived mentions can be instantiated directly as members of those classes.
creator: Generated for Venkat Ram Rao
license: https://creativecommons.org/licenses/by/4.0/
version info: 0.1.0

Antarctica
type: Class
subclass of: Continent
comment: Country/country-like geography class. Document-parsed mentions of this geography can be instantiated as members of this class.

Democratic Republic of the Congo
type: Class
subclass of: Country
subclass of: Central Africa
comment: Country/country-like geography class. Document-parsed mentions of this geography can be instantiated as members of this class.
ISO 3166-1 alpha-2 code: CD
ISO 3166-1 alpha-3 code: COD
source subregion name: Middle Africa
source region name: Africa
part of class: Central Africa

Morocco
type: Class
subclass of: Country
subclass of: North Africa
comment: Country/country-like geography class. Document-parsed mentions of this geography can be instantiated as members of this class.
ISO 3166-1 alpha-2 code: MA
ISO 3166-1 alpha-3 code: MAR
source subregion name: Northern Africa
source region name: Africa
part of class: North Africa

Gabon
type: Class
subclass of: Country
subclass of: Central Africa
comment: Country/country-like geography class. Document-parsed mentions of this geography can be instantiated as members of this class.
ISO 3166-1 alpha-2 code: GA
ISO 3166-1 alpha-3 code: GAB
source subregion name: Middle Africa
source region name: Africa
part of class: Central Africa

Cocos (Keeling) Islands
type: Class
subclass of: Country
subclass of: Australia And New Zealand
comment: Country/country-like geography class. Document-parsed mentions of this geography can be instantiated as members of this class.
ISO 3166-1 alpha-2 code: CC
ISO 3166-1 alpha-3 code: CCK
source subregion name: Australia and New Zealand
source region name: Oceania
part of class: Australia And New Zealand

Costa Rica
type: Class
subclass of: Country
subclass of: Central America
comment: Country/country-like geography class. Document-parsed mentions of this geography can be instantiated as members of this class.
ISO 3166-1 alpha-2 code: CR
ISO 3166-1 alpha-3 code: CRI
source subregion name: Central America
source region name: Americas
part of class: Central America

Algeria
type: Class
subclass of: Country
subclass of: North Africa
comment: Country/country-like geography class. Document-parsed mentions of this geography can be instantiated as members of this class.
ISO 3166-1 alpha-2 code: DZ
ISO 3166-1 alpha-3 code: DZA
source subregion name: Northern Africa
source region name: Africa
part of class: North Africa

Japan
type: Class
subclass of: Country
subclass of: East Asia
comment: Country/country-like geography class. Document-parsed mentions of this geography can be instantiated as members of this class.
ISO 3166-1 alpha-2 code: JP
ISO 3166-1 alpha-3 code: JPN
source subregion name: Eastern Asia
source region name: Asia
part of class: East Asia

Chile
type: Class
subclass of: Country
subclass of: South America
comment: Country/country-like geography class. Document-parsed mentions of this geography can be instantiated as members of this class.
ISO 3166-1 alpha-2 code: CL
ISO 3166-1 alpha-3 code: CHL
source subregion name: South America
source region name: Americas
part of class: South America

Senegal
type: Class
subclass of: Country
subclass of: West Africa
comment: Country/country-like geography class. Document-parsed mentions of this geography can be instantiated as members of this class.
ISO 3166-1 alpha-2 code: SN
ISO 3166-1 alpha-3 code: SEN
source subregion name: Western Africa
source region name: Africa
part of class: West Africa

Cape Verde
type: Class
subclass of: Country
subclass of: West Africa
comment: Country/country-like geography class. Document-parsed mentions of this geography can be instantiated as members of this class.
ISO 3166-1 alpha-2 code: CV
ISO 3166-1 alpha-3 code: CPV
source subregion name: Western Africa
source region name: Africa
part of class: West Africa

Mauritius
type: Class
subclass of: Country
subclass of: East Africa
comment: Country/country-like geography class. Document-parsed mentions of this geography can be instantiated as members of this class.
ISO 3166-1 alpha-2 code: MU
ISO 3166-1 alpha-3 code: MUS
source subregion name: Eastern Africa
source region name: Africa
part of class: East Africa

Qatar
type: Class
subclass of: Country
subclass of: Middle East
comment: Country/country-like geography class. Document-parsed mentions of this geography can be instantiated as members of this class.
ISO 3166-1 alpha-2 code: QA
ISO 3166-1 alpha-3 code: QAT
source subregion name: Western Asia
source region name: Asia
part of class: Middle East

Niger
type: Class
subclass of: Country
subclass of: West Africa
comment: Country/country-like geography class. Document-parsed mentions of this geography can be instantiated as members of this class.
ISO 3166-1 alpha-2 code: NE
ISO 3166-1 alpha-3 code: NER
source subregion name: Western Africa
source region name: Africa
part of class: West Africa

part of class
type: AnnotationProperty
comment: Annotation linking a geography class to its parent geography class. The formal hierarchy is also represented with rdfs:subClassOf.

Uganda
type: Class
subclass of: Country
subclass of: East Africa
comment: Country/country-like geography class. Document-parsed mentions of this geography can be instantiated as members of this class.
ISO 3166-1 alpha-2 code: UG
ISO 3166-1 alpha-3 code: UGA
source subregion name: Eastern Africa
source region name: Africa
part of class: East Africa

Southeast Asia
type: Class
subclass of: Region
subclass of: Asia
part of class: Asia

Bermuda
type: Class
subclass of: Country
subclass of: North America
comment: Country/country-like geography class. Document-parsed mentions of this geography can be instantiated as members of this class.
ISO 3166-1 alpha-2 code: BM
ISO 3166-1 alpha-3 code: BMU
source subregion name: Northern America
source region name: Americas
part of class: North America

Central African Republic
type: Class
subclass of: Country
subclass of: Central Africa
comment: Country/country-like geography class. Document-parsed mentions of this geography can be instantiated as members of this class.
ISO 3166-1 alpha-2 code: CF
ISO 3166-1 alpha-3 code: CAF
source subregion name: Middle Africa
source region name: Africa
part of class: Central Africa

French Southern and Antarctic Lands
type: Class
subclass of: Country
comment: Country/country-like geography class. Document-parsed mentions of this geography can be instantiated as members of this class.
ISO 3166-1 alpha-2 code: TF
ISO 3166-1 alpha-3 code: ATF

North Africa
type: Class
subclass of: Region
subclass of: Africa
part of class: Africa

Guam
type: Class
subclass of: Country
subclass of: Micronesia
comment: Country/country-like geography class. Document-parsed mentions of this geography can be instantiated as members of this class.
ISO 3166-1 alpha-2 code: GU
ISO 3166-1 alpha-3 code: GUM
source subregion name: Micronesia
source region name: Oceania
part of class: Micronesia

Malaysia
type: Class
subclass of: Country
subclass of: Southeast Asia
comment: Country/country-like geography class. Document-parsed mentions of this geography can be instantiated as members of this class.
ISO 3166-1 alpha-2 code: MY
ISO 3166-1 alpha-3 code: MYS
source subregion name: South-Eastern Asia
source region name: Asia
part of class: Southeast Asia

Slovakia
type: Class
subclass of: Country
subclass of: Eastern Europe
comment: Country/country-like geography class. Document-parsed mentions of this geography can be instantiated as members of this class.
ISO 3166-1 alpha-2 code: SK
ISO 3166-1 alpha-3 code: SVK
source subregion name: Eastern Europe
source region name: Europe
part of class: Eastern Europe

Wallis and Futuna
type: Class
subclass of: Country
subclass of: Polynesia
comment: Country/country-like geography class. Document-parsed mentions of this geography can be instantiated as members of this class.
ISO 3166-1 alpha-2 code: WF
ISO 3166-1 alpha-3 code: WLF
source subregion name: Polynesia
source region name: Oceania
part of class: Polynesia

North Korea
type: Class
subclass of: Country
subclass of: East Asia
comment: Country/country-like geography class. Document-parsed mentions of this geography can be instantiated as members of this class.
ISO 3166-1 alpha-2 code: KP
ISO 3166-1 alpha-3 code: PRK
source subregion name: Eastern Asia
source region name: Asia
part of class: East Asia

Continent
type: Class
comment: A large landmass or continental-scale geographic grouping.
subclass of: Geographic Entity

Paraguay
type: Class
subclass of: Country
subclass of: South America
comment: Country/country-like geography class. Document-parsed mentions of this geography can be instantiated as members of this class.
ISO 3166-1 alpha-2 code: PY
ISO 3166-1 alpha-3 code: PRY
source subregion name: South America
source region name: Americas
part of class: South America

Bolivia
type: Class
subclass of: Country
subclass of: South America
comment: Country/country-like geography class. Document-parsed mentions of this geography can be instantiated as members of this class.
ISO 3166-1 alpha-2 code: BO
ISO 3166-1 alpha-3 code: BOL
source subregion name: South America
source region name: Americas
part of class: South America

Nicaragua
type: Class
subclass of: Country
subclass of: Central America
comment: Country/country-like geography class. Document-parsed mentions of this geography can be instantiated as members of this class.
ISO 3166-1 alpha-2 code: NI
ISO 3166-1 alpha-3 code: NIC
source subregion name: Central America
source region name: Americas
part of class: Central America

Central Africa
type: Class
subclass of: Region
subclass of: Africa
part of class: Africa

Mozambique
type: Class
subclass of: Country
subclass of: East Africa
comment: Country/country-like geography class. Document-parsed mentions of this geography can be instantiated as members of this class.
ISO 3166-1 alpha-2 code: MZ
ISO 3166-1 alpha-3 code: MOZ
source subregion name: Eastern Africa
source region name: Africa
part of class: East Africa

Ukraine
type: Class
subclass of: Country
subclass of: Eastern Europe
comment: Country/country-like geography class. Document-parsed mentions of this geography can be instantiated as members of this class.
ISO 3166-1 alpha-2 code: UA
ISO 3166-1 alpha-3 code: UKR
source subregion name: Eastern Europe
source region name: Europe
part of class: Eastern Europe

El Salvador
type: Class
subclass of: Country
subclass of: Central America
comment: Country/country-like geography class. Document-parsed mentions of this geography can be instantiated as members of this class.
ISO 3166-1 alpha-2 code: SV
ISO 3166-1 alpha-3 code: SLV
source subregion name: Central America
source region name: Americas
part of class: Central America

Canada
type: Class
subclass of: Country
subclass of: North America
comment: Country/country-like geography class. Document-parsed mentions of this geography can be instantiated as members of this class.
ISO 3166-1 alpha-2 code: CA
ISO 3166-1 alpha-3 code: CAN
source subregion name: Northern America
source region name: Americas
part of class: North America

Croatia
type: Class
subclass of: Country
subclass of: Southern Europe
comment: Country/country-like geography class. Document-parsed mentions of this geography can be instantiated as members of this class.
ISO 3166-1 alpha-2 code: HR
ISO 3166-1 alpha-3 code: HRV
source subregion name: Southern Europe
source region name: Europe
part of class: Southern Europe

San Marino
type: Class
subclass of: Country
subclass of: Southern Europe
comment: Country/country-like geography class. Document-parsed mentions of this geography can be instantiated as members of this class.
ISO 3166-1 alpha-2 code: SM
ISO 3166-1 alpha-3 code: SMR
source subregion name: Southern Europe
source region name: Europe
part of class: Southern Europe

Tonga
type: Class
subclass of: Country
subclass of: Polynesia
comment: Country/country-like geography class. Document-parsed mentions of this geography can be instantiated as members of this class.
ISO 3166-1 alpha-2 code: TO
ISO 3166-1 alpha-3 code: TON
source subregion name: Polynesia
source region name: Oceania
part of class: Polynesia

Armenia
type: Class
subclass of: Country
subclass of: Middle East
comment: Country/country-like geography class. Document-parsed mentions of this geography can be instantiated as members of this class.
ISO 3166-1 alpha-2 code: AM
ISO 3166-1 alpha-3 code: ARM
source subregion name: Western Asia
source region name: Asia
part of class: Middle East

South Sudan
type: Class
subclass of: Country
subclass of: Central Africa
comment: Country/country-like geography class. Document-parsed mentions of this geography can be instantiated as members of this class.
ISO 3166-1 alpha-2 code: SS
ISO 3166-1 alpha-3 code: SSD
source subregion name: Middle Africa
source region name: Africa
part of class: Central Africa

Turkmenistan
type: Class
subclass of: Country
subclass of: Central Asia
comment: Country/country-like geography class. Document-parsed mentions of this geography can be instantiated as members of this class.
ISO 3166-1 alpha-2 code: TM
ISO 3166-1 alpha-3 code: TKM
source subregion name: Central Asia
source region name: Asia
part of class: Central Asia

Midway Islands
type: Class
subclass of: Country
comment: Country/country-like geography class. Document-parsed mentions of this geography can be instantiated as members of this class.

Macau
type: Class
subclass of: Country
subclass of: East Asia
comment: Country/country-like geography class. Document-parsed mentions of this geography can be instantiated as members of this class.
ISO 3166-1 alpha-2 code: MO
ISO 3166-1 alpha-3 code: MAC
source subregion name: Eastern Asia
source region name: Asia
part of class: East Asia

Portugal
type: Class
subclass of: Country
subclass of: Southern Europe
comment: Country/country-like geography class. Document-parsed mentions of this geography can be instantiated as members of this class.
ISO 3166-1 alpha-2 code: PT
ISO 3166-1 alpha-3 code: PRT
source subregion name: Southern Europe
source region name: Europe
part of class: Southern Europe

Puerto Rico
type: Class
subclass of: Country
subclass of: Caribbean
comment: Country/country-like geography class. Document-parsed mentions of this geography can be instantiated as members of this class.
ISO 3166-1 alpha-2 code: PR
ISO 3166-1 alpha-3 code: PRI
source subregion name: Caribbean
source region name: Americas
part of class: Caribbean

North America
type: Class
subclass of: Region
subclass of: North And South America
part of class: North And South America

Czech Republic
type: Class
subclass of: Country
subclass of: Eastern Europe
comment: Country/country-like geography class. Document-parsed mentions of this geography can be instantiated as members of this class.
ISO 3166-1 alpha-2 code: CZ
ISO 3166-1 alpha-3 code: CZE
source subregion name: Eastern Europe
source region name: Europe
part of class: Eastern Europe

Iran
type: Class
subclass of: Country
subclass of: Middle East
comment: Country/country-like geography class. Document-parsed mentions of this geography can be instantiated as members of this class.
ISO 3166-1 alpha-2 code: IR
ISO 3166-1 alpha-3 code: IRN
source subregion name: Middle East
source region name: Asia
part of class: Middle East

Haiti
type: Class
subclass of: Country
subclass of: Caribbean
comment: Country/country-like geography class. Document-parsed mentions of this geography can be instantiated as members of this class.
ISO 3166-1 alpha-2 code: HT
ISO 3166-1 alpha-3 code: HTI
source subregion name: Caribbean
source region name: Americas
part of class: Caribbean

source region name
type: AnnotationProperty

Gibraltar
type: Class
subclass of: Country
subclass of: Southern Europe
comment: Country/country-like geography class. Document-parsed mentions of this geography can be instantiated as members of this class.
ISO 3166-1 alpha-2 code: GI
ISO 3166-1 alpha-3 code: GIB
source subregion name: Southern Europe
source region name: Europe
part of class: Southern Europe

United States
type: Class
subclass of: Country
subclass of: North America
comment: Country/country-like geography class. Document-parsed mentions of this geography can be instantiated as members of this class.
ISO 3166-1 alpha-2 code: US
ISO 3166-1 alpha-3 code: USA
source subregion name: Northern America
source region name: Americas
part of class: North America

South Asia
type: Class
subclass of: Region
subclass of: Asia
part of class: Asia

Syria
type: Class
subclass of: Country
subclass of: Middle East
comment: Country/country-like geography class. Document-parsed mentions of this geography can be instantiated as members of this class.
ISO 3166-1 alpha-2 code: SY
ISO 3166-1 alpha-3 code: SYR
source subregion name: Western Asia
source region name: Asia
part of class: Middle East

Barbados
type: Class
subclass of: Country
subclass of: Caribbean
comment: Country/country-like geography class. Document-parsed mentions of this geography can be instantiated as members of this class.
ISO 3166-1 alpha-2 code: BB
ISO 3166-1 alpha-3 code: BRB
source subregion name: Caribbean
source region name: Americas
part of class: Caribbean

Australia And New Zealand
type: Class
subclass of: Region
subclass of: Oceania
part of class: Oceania

Netherlands Antilles
type: Class
subclass of: Country
comment: Country/country-like geography class. Document-parsed mentions of this geography can be instantiated as members of this class.
ISO 3166-1 alpha-3 code: ANT

Maldives
type: Class
subclass of: Country
subclass of: South Asia
comment: Country/country-like geography class. Document-parsed mentions of this geography can be instantiated as members of this class.
ISO 3166-1 alpha-2 code: MV
ISO 3166-1 alpha-3 code: MDV
source subregion name: Southern Asia
source region name: Asia
part of class: South Asia

Bulgaria
type: Class
subclass of: Country
subclass of: Eastern Europe
comment: Country/country-like geography class. Document-parsed mentions of this geography can be instantiated as members of this class.
ISO 3166-1 alpha-2 code: BG
ISO 3166-1 alpha-3 code: BGR
source subregion name: Eastern Europe
source region name: Europe
part of class: Eastern Europe

Taiwan
type: Class
subclass of: Country
subclass of: East Asia
comment: Country/country-like geography class. Document-parsed mentions of this geography can be instantiated as members of this class.
ISO 3166-1 alpha-2 code: TW
ISO 3166-1 alpha-3 code: TWN
source subregion name: Eastern Asia
source region name: Asia
part of class: East Asia

East Africa
type: Class
subclass of: Region
subclass of: Africa
part of class: Africa

Tunisia
type: Class
subclass of: Country
subclass of: North Africa
comment: Country/country-like geography class. Document-parsed mentions of this geography can be instantiated as members of this class.
ISO 3166-1 alpha-2 code: TN
ISO 3166-1 alpha-3 code: TUN
source subregion name: Northern Africa
source region name: Africa
part of class: North Africa

Tokelau
type: Class
subclass of: Country
subclass of: Polynesia
comment: Country/country-like geography class. Document-parsed mentions of this geography can be instantiated as members of this class.
ISO 3166-1 alpha-2 code: TK
ISO 3166-1 alpha-3 code: TKL
source subregion name: Polynesia
source region name: Oceania
part of class: Polynesia

Gaza Strip
type: Class
subclass of: Country
comment: Country/country-like geography class. Document-parsed mentions of this geography can be instantiated as members of this class.

Falkland Islands
type: Class
subclass of: Country
subclass of: South America
comment: Country/country-like geography class. Document-parsed mentions of this geography can be instantiated as members of this class.
ISO 3166-1 alpha-2 code: FK
ISO 3166-1 alpha-3 code: FLK
source subregion name: South America
source region name: Americas
part of class: South America

Namibia
type: Class
subclass of: Country
subclass of: Southern Africa
comment: Country/country-like geography class. Document-parsed mentions of this geography can be instantiated as members of this class.
ISO 3166-1 alpha-2 code: NA
ISO 3166-1 alpha-3 code: NAM
source subregion name: Southern Africa
source region name: Africa
part of class: Southern Africa

Ireland Northern
type: Class
subclass of: Country
comment: Country/country-like geography class. Document-parsed mentions of this geography can be instantiated as members of this class.

East Timor
type: Class
subclass of: Country
subclass of: Southeast Asia
comment: Country/country-like geography class. Document-parsed mentions of this geography can be instantiated as members of this class.
ISO 3166-1 alpha-2 code: TL
ISO 3166-1 alpha-3 code: TLS
source subregion name: South-Eastern Asia
source region name: Asia
part of class: Southeast Asia

Brunei
type: Class
subclass of: Country
subclass of: Southeast Asia
comment: Country/country-like geography class. Document-parsed mentions of this geography can be instantiated as members of this class.
ISO 3166-1 alpha-2 code: BN
ISO 3166-1 alpha-3 code: BRN
source subregion name: South-Eastern Asia
source region name: Asia
part of class: Southeast Asia

Mongolia
type: Class
subclass of: Country
subclass of: East Asia
comment: Country/country-like geography class. Document-parsed mentions of this geography can be instantiated as members of this class.
ISO 3166-1 alpha-2 code: MN
ISO 3166-1 alpha-3 code: MNG
source subregion name: Eastern Asia
source region name: Asia
part of class: East Asia

Uruguay
type: Class
subclass of: Country
subclass of: South America
comment: Country/country-like geography class. Document-parsed mentions of this geography can be instantiated as members of this class.
ISO 3166-1 alpha-2 code: UY
ISO 3166-1 alpha-3 code: URY
source subregion name: South America
source region name: Americas
part of class: South America

Uzbekistan
type: Class
subclass of: Country
subclass of: Central Asia
comment: Country/country-like geography class. Document-parsed mentions of this geography can be instantiated as members of this class.
ISO 3166-1 alpha-2 code: UZ
ISO 3166-1 alpha-3 code: UZB
source subregion name: Central Asia
source region name: Asia
part of class: Central Asia

Moldova
type: Class
subclass of: Country
subclass of: Eastern Europe
comment: Country/country-like geography class. Document-parsed mentions of this geography can be instantiated as members of this class.
ISO 3166-1 alpha-2 code: MD
ISO 3166-1 alpha-3 code: MDA
source subregion name: Eastern Europe
source region name: Europe
part of class: Eastern Europe

Réunion
type: Class
subclass of: Country
subclass of: East Africa
comment: Country/country-like geography class. Document-parsed mentions of this geography can be instantiated as members of this class.
ISO 3166-1 alpha-2 code: RE
ISO 3166-1 alpha-3 code: REU
source subregion name: Eastern Africa
source region name: Africa
part of class: East Africa

Switzerland
type: Class
subclass of: Country
subclass of: Western Europe
comment: Country/country-like geography class. Document-parsed mentions of this geography can be instantiated as members of this class.
ISO 3166-1 alpha-2 code: CH
ISO 3166-1 alpha-3 code: CHE
source subregion name: Western Europe
source region name: Europe
part of class: Western Europe

Western Europe
type: Class
subclass of: Region
subclass of: Europe
part of class: Europe

Albania
type: Class
subclass of: Country
subclass of: Southern Europe
comment: Country/country-like geography class. Document-parsed mentions of this geography can be instantiated as members of this class.
ISO 3166-1 alpha-2 code: AL
ISO 3166-1 alpha-3 code: ALB
source subregion name: Southern Europe
source region name: Europe
part of class: Southern Europe

Ashmore And Cartier Island
type: Class
subclass of: Country
comment: Country/country-like geography class. Document-parsed mentions of this geography can be instantiated as members of this class.

Venezuela
type: Class
subclass of: Country
subclass of: South America
comment: Country/country-like geography class. Document-parsed mentions of this geography can be instantiated as members of this class.
ISO 3166-1 alpha-2 code: VE
ISO 3166-1 alpha-3 code: VEN
source subregion name: South America
source region name: Americas
part of class: South America

Heard Island and McDonald Islands
type: Class
subclass of: Country
comment: Country/country-like geography class. Document-parsed mentions of this geography can be instantiated as members of this class.
ISO 3166-1 alpha-2 code: HM
ISO 3166-1 alpha-3 code: HMD

Northern Europe
type: Class
subclass of: Region
subclass of: Europe
part of class: Europe

British Indian Ocean Territory
type: Class
subclass of: Country
subclass of: East Africa
comment: Country/country-like geography class. Document-parsed mentions of this geography can be instantiated as members of this class.
ISO 3166-1 alpha-2 code: IO
ISO 3166-1 alpha-3 code: IOT
source subregion name: Eastern Africa
source region name: Africa
part of class: East Africa

Geography Mention
type: Class
comment: An extracted mention from a document. It may also be typed as a specific geography class such as India or SouthAsia.

Georgia
type: Class
subclass of: Country
subclass of: Middle East
comment: Country/country-like geography class. Document-parsed mentions of this geography can be instantiated as members of this class.
ISO 3166-1 alpha-2 code: GE
ISO 3166-1 alpha-3 code: GEO
source subregion name: Western Asia
source region name: Asia
part of class: Middle East

Africa
type: Class
subclass of: Continent

Norway
type: Class
subclass of: Country
subclass of: Northern Europe
comment: Country/country-like geography class. Document-parsed mentions of this geography can be instantiated as members of this class.
ISO 3166-1 alpha-2 code: NO
ISO 3166-1 alpha-3 code: NOR
source subregion name: Northern Europe
source region name: Europe
part of class: Northern Europe

Saint Helena
type: Class
subclass of: Country
subclass of: West Africa
comment: Country/country-like geography class. Document-parsed mentions of this geography can be instantiated as members of this class.
ISO 3166-1 alpha-2 code: SH
ISO 3166-1 alpha-3 code: SHN
source subregion name: Western Africa
source region name: Africa
part of class: West Africa

Singapore
type: Class
subclass of: Country
subclass of: Southeast Asia
comment: Country/country-like geography class. Document-parsed mentions of this geography can be instantiated as members of this class.
ISO 3166-1 alpha-2 code: SG
ISO 3166-1 alpha-3 code: SGP
source subregion name: South-Eastern Asia
source region name: Asia
part of class: Southeast Asia

Jersey
type: Class
subclass of: Country
subclass of: Northern Europe
comment: Country/country-like geography class. Document-parsed mentions of this geography can be instantiated as members of this class.
ISO 3166-1 alpha-2 code: JE
ISO 3166-1 alpha-3 code: JEY
source subregion name: Northern Europe
source region name: Europe
part of class: Northern Europe

Isle of Man
type: Class
subclass of: Country
subclass of: Northern Europe
comment: Country/country-like geography class. Document-parsed mentions of this geography can be instantiated as members of this class.
ISO 3166-1 alpha-2 code: IM
ISO 3166-1 alpha-3 code: IMN
source subregion name: Northern Europe
source region name: Europe
part of class: Northern Europe

Zambia
type: Class
subclass of: Country
subclass of: East Africa
comment: Country/country-like geography class. Document-parsed mentions of this geography can be instantiated as members of this class.
ISO 3166-1 alpha-2 code: ZM
ISO 3166-1 alpha-3 code: ZMB
source subregion name: Eastern Africa
source region name: Africa
part of class: East Africa

Southern Africa
type: Class
subclass of: Region
subclass of: Africa
part of class: Africa

Europe
type: Class
subclass of: Continent

Sierra Leone
type: Class
subclass of: Country
subclass of: West Africa
comment: Country/country-like geography class. Document-parsed mentions of this geography can be instantiated as members of this class.
ISO 3166-1 alpha-2 code: SL
ISO 3166-1 alpha-3 code: SLE
source subregion name: Western Africa
source region name: Africa
part of class: West Africa

Anguilla
type: Class
subclass of: Country
subclass of: Caribbean
comment: Country/country-like geography class. Document-parsed mentions of this geography can be instantiated as members of this class.
ISO 3166-1 alpha-2 code: AI
ISO 3166-1 alpha-3 code: AIA
source subregion name: Caribbean
source region name: Americas
part of class: Caribbean

Southern Europe
type: Class
subclass of: Region
subclass of: Europe
part of class: Europe

Holy See Vatican City
type: Class
subclass of: Country
comment: Country/country-like geography class. Document-parsed mentions of this geography can be instantiated as members of this class.

Cuba
type: Class
subclass of: Country
subclass of: Caribbean
comment: Country/country-like geography class. Document-parsed mentions of this geography can be instantiated as members of this class.
ISO 3166-1 alpha-2 code: CU
ISO 3166-1 alpha-3 code: CUB
source subregion name: Caribbean
source region name: Americas
part of class: Caribbean

has part
type: ObjectProperty
comment: Inverse of partOf for geography individuals or document mentions.
inverse of: part of

American Samoa
type: Class
subclass of: Country
subclass of: Polynesia
comment: Country/country-like geography class. Document-parsed mentions of this geography can be instantiated as members of this class.
ISO 3166-1 alpha-2 code: AS
ISO 3166-1 alpha-3 code: ASM
source subregion name: Polynesia
source region name: Oceania
part of class: Polynesia

Peru
type: Class
subclass of: Country
subclass of: South America
comment: Country/country-like geography class. Document-parsed mentions of this geography can be instantiated as members of this class.
ISO 3166-1 alpha-2 code: PE
ISO 3166-1 alpha-3 code: PER
source subregion name: South America
source region name: Americas
part of class: South America

Saudi Arabia
type: Class
subclass of: Country
subclass of: Middle East
comment: Country/country-like geography class. Document-parsed mentions of this geography can be instantiated as members of this class.
ISO 3166-1 alpha-2 code: SA
ISO 3166-1 alpha-3 code: SAU
source subregion name: Western Asia
source region name: Asia
part of class: Middle East

Romania
type: Class
subclass of: Country
subclass of: Eastern Europe
comment: Country/country-like geography class. Document-parsed mentions of this geography can be instantiated as members of this class.
ISO 3166-1 alpha-2 code: RO
ISO 3166-1 alpha-3 code: ROU
source subregion name: Eastern Europe
source region name: Europe
part of class: Eastern Europe

Poland
type: Class
subclass of: Country
subclass of: Eastern Europe
comment: Country/country-like geography class. Document-parsed mentions of this geography can be instantiated as members of this class.
ISO 3166-1 alpha-2 code: PL
ISO 3166-1 alpha-3 code: POL
source subregion name: Eastern Europe
source region name: Europe
part of class: Eastern Europe

Monaco
type: Class
subclass of: Country
subclass of: Western Europe
comment: Country/country-like geography class. Document-parsed mentions of this geography can be instantiated as members of this class.
ISO 3166-1 alpha-2 code: MC
ISO 3166-1 alpha-3 code: MCO
source subregion name: Western Europe
source region name: Europe
part of class: Western Europe

Seychelles
type: Class
subclass of: Country
subclass of: East Africa
comment: Country/country-like geography class. Document-parsed mentions of this geography can be instantiated as members of this class.
ISO 3166-1 alpha-2 code: SC
ISO 3166-1 alpha-3 code: SYC
source subregion name: Eastern Africa
source region name: Africa
part of class: East Africa

Geographic Entity
type: Class
comment: Any geographic concept or place-like entity.

Jamaica
type: Class
subclass of: Country
subclass of: Caribbean
comment: Country/country-like geography class. Document-parsed mentions of this geography can be instantiated as members of this class.
ISO 3166-1 alpha-2 code: JM
ISO 3166-1 alpha-3 code: JAM
source subregion name: Caribbean
source region name: Americas
part of class: Caribbean

Country
type: Class
comment: A country or country-like ISO 3166 geography.
subclass of: Geographic Entity

Belgium
type: Class
subclass of: Country
subclass of: Western Europe
comment: Country/country-like geography class. Document-parsed mentions of this geography can be instantiated as members of this class.
ISO 3166-1 alpha-2 code: BE
ISO 3166-1 alpha-3 code: BEL
source subregion name: Western Europe
source region name: Europe
part of class: Western Europe

South America
type: Class
subclass of: Region
subclass of: North And South America
part of class: North And South America

Central America
type: Class
subclass of: Region
subclass of: North And South America
part of class: North And South America

Spain
type: Class
subclass of: Country
subclass of: Southern Europe
comment: Country/country-like geography class. Document-parsed mentions of this geography can be instantiated as members of this class.
ISO 3166-1 alpha-2 code: ES
ISO 3166-1 alpha-3 code: ESP
source subregion name: Southern Europe
source region name: Europe
part of class: Southern Europe

West Bank
type: Class
subclass of: Country
comment: Country/country-like geography class. Document-parsed mentions of this geography can be instantiated as members of this class.

Juan De Nova Island
type: Class
subclass of: Country
comment: Country/country-like geography class. Document-parsed mentions of this geography can be instantiated as members of this class.

Burma
type: Class
subclass of: Country
comment: Country/country-like geography class. Document-parsed mentions of this geography can be instantiated as members of this class.

Caribbean
type: Class
subclass of: Region
subclass of: North And South America
part of class: North And South America

extracted from document
type: ObjectProperty
comment: Links an extracted geography mention instance to the document or chunk from which it was parsed.

source subregion name
type: AnnotationProperty

Tanzania
type: Class
subclass of: Country
subclass of: East Africa
comment: Country/country-like geography class. Document-parsed mentions of this geography can be instantiated as members of this class.
ISO 3166-1 alpha-2 code: TZ
ISO 3166-1 alpha-3 code: TZA
source subregion name: Eastern Africa
source region name: Africa
part of class: East Africa

Jan Mayen
type: Class
subclass of: Country
comment: Country/country-like geography class. Document-parsed mentions of this geography can be instantiated as members of this class.

Eastern Europe
type: Class
subclass of: Region
subclass of: Europe
part of class: Europe

Oceania
type: Class
subclass of: Continent

ISO 3166-1 alpha-2 code
type: AnnotationProperty

mentions geography
type: ObjectProperty
comment: Links a document, chunk, or extracted artifact to a geography mention/entity.

West Africa
type: Class
subclass of: Region
subclass of: Africa
part of class: Africa